news.php.net/php.qa.reports    Page: (300) [Reload] [Post] [OE] [Favorites] [Ranking] [Next]
Subject From Date Size
php_test_results_20170831_1639 contact 01/09/2017 12:55 AM 1KB
5.6.31 // make test on debian 9.1 x86-64 mircea.simion 30/08/2017 03:50 AM 1KB
PHP 7.1.7 FAILED TEST SUMMARY REPORT margaret.m.bauer 26/07/2017 10:51 PM 1KB
FAILED TEST SUMMARY margaret.m.bauer 26/07/2017 12:38 PM 1KB
Attached php test results for make-test on 7.1.6 fred.landau 07/07/2017 04:28 AM 1KB
TEST SUMMARY schnoerkel 06/07/2017 12:20 AM 1KB
Error report generated in make test (php-7.1.6) kamauallan 14/06/2017 11:34 PM 1KB
PHP 7.2.0alpha1 make test report zoeslam 08/06/2017 10:56 PM 1KB
PHP: make test output Markus.Loch 30/05/2017 03:00 PM 1KB
PHP TEST RESULTS <FAIL> crawls 25/05/2017 10:47 PM 1KB
Failed Test - Bug #74090 marcel.oliveira 24/05/2017 10:25 PM 1KB
report test php - installation source - Lima Peru ccarrera 24/05/2017 04:52 AM 1KB
bug report bacon 08/05/2017 08:24 PM 1KB
[PUTS] Summary PHP_7_1 r44fdae4-NTS-X64 ostcpftt2 26/04/2017 01:21 AM 1KB
PHP 7.1.4 make test failure report maplelzf 18/04/2017 11:29 AM 1KB
You may have found a problem in PHP. jiaoxinhe 15/04/2017 01:06 PM 1KB
PHP GMP make test errors Steve.Campbell 11/04/2017 12:25 AM 1KB
bug 74090 stream_get_contents maxlength>-1 returns empty string onwindows [ext/standard/tests/streams/bug74090.phpt] algarcia 23/03/2017 11:11 PM 1KB
[Potential bugs] make test results andrzej.rozenfeld 21/03/2017 07:35 PM 1KB
PHP bug thayalan 18/03/2017 08:53 PM 1KB
PHP-7.1.2 test report marcin.zyrkowski 17/03/2017 06:18 PM 1KB
[PUTS] Summary PHP_Master r6ad0a6f-TS-X86 ostcpftt2 16/03/2017 07:13 PM 1KB
[PUTS] Summary PHP_7_1 r3d4e954-NTS-X64 ostcpftt2 16/03/2017 04:48 PM 1KB
[PUTS] Summary PHP_Master r6ad0a6f-NTS-X64 ostcpftt2 16/03/2017 02:53 PM 1KB
[PUTS] Summary PHP_Master r8a7a141-TS-X64 ostcpftt2 16/03/2017 03:39 AM 1KB
[PUTS] Summary PHP_7_1 r8f79913-NTS-X64 ostcpftt2 09/03/2017 05:40 PM 1KB
[PUTS] Summary PHP_7_1 r1a19b97-TS-X64 ostcpftt2 09/03/2017 06:51 AM 1KB
[PUTS] Summary PHP_Master r2ba2b76-NTS-X64 ostcpftt2 08/03/2017 06:04 PM 1KB
[PUTS] Summary PHP_7_1 r1a19b97-NTS-X64 ostcpftt2 08/03/2017 06:02 PM 1KB
php_test_results_20170303_0319 15060447211 03/03/2017 11:37 AM 1KB
php_test_results_20170227_1105.txt dlenehan 28/02/2017 11:54 AM 1KB
[PUTS] Summary PHP_Master r0d529d6-TS-X64 ostcpftt2 13/02/2017 05:02 PM 1KB
Message after make tests for xdebug rmdgroep 06/02/2017 11:50 PM 1KB
test report php 5.6.30 rbon 04/02/2017 06:50 AM 1KB
[PUTS] Summary PHP_Master r3488cc9-TS-X64 ostcpftt2 02/02/2017 05:12 PM 1KB
[PUTS] Summary PHP_7_1 rad5038b-TS-X64 ostcpftt2 02/02/2017 05:07 PM 1KB
[PUTS] Summary PHP_Master r10cd885-TS-X64 ostcpftt2 30/01/2017 11:28 AM 1KB
[PUTS] Summary PHP_7_1 r2a5a310-TS-X64 ostcpftt2 30/01/2017 11:26 AM 1KB
[PUTS] Summary PHP_Master r3de7b2a-NTS-X64 ostcpftt2 29/01/2017 05:14 PM 1KB
[PUTS] Summary PHP_7_1 r366f838-TS-X86 ostcpftt2 29/01/2017 05:11 PM 1KB
[PUTS] Summary PHP_Master r3de7b2a-TS-X64 ostcpftt2 29/01/2017 10:56 AM 1KB
[PUTS] Summary PHP_Master r47c2da9-NTS-X64 ostcpftt2 28/01/2017 06:59 PM 1KB
[PUTS] Summary PHP_7_1 r366f838-TS-X64 ostcpftt2 28/01/2017 06:55 PM 1KB
[PUTS] Summary PHP_Master r8302a29-TS-X64 ostcpftt2 28/01/2017 05:11 PM 1KB
[PUTS] Summary PHP_7_1 rc11b2b8-NTS-X64 ostcpftt2 28/01/2017 05:08 PM 1KB
PHP 7.0.14 test failure on btrfs leo 28/01/2017 04:26 PM 1KB
[PUTS] Summary PHP_Master r8302a29-NTS-X64 ostcpftt2 28/01/2017 01:58 PM 1KB
[PUTS] Summary PHP_7_1 rbf914ff-TS-X64 ostcpftt2 28/01/2017 01:55 PM 1KB
[PUTS] Summary PHP_Master re7166d1-NTS-X64 ostcpftt2 26/01/2017 04:27 AM 1KB
[PUTS] Summary PHP_7_1 rec78507-TS-X64 ostcpftt2 26/01/2017 04:23 AM 1KB
[PUTS] Summary PHP_Master re7166d1-TS-X64 ostcpftt2 25/01/2017 03:08 PM 1KB
[PUTS] Summary PHP_7_1 rec78507-NTS-X64 ostcpftt2 25/01/2017 03:05 PM 1KB
[PUTS] Summary PHP_7_1 r9aad380-TS-X86 ostcpftt2 24/01/2017 08:40 AM 1KB
[PUTS] Summary PHP_Master r7cba315-NTS-X64 ostcpftt2 24/01/2017 07:51 AM 1KB
[PUTS] Summary PHP_7_1 r9aad380-TS-X64 ostcpftt2 24/01/2017 07:48 AM 1KB
[PUTS] Summary PHP_Master r7cba315-TS-X64 ostcpftt2 24/01/2017 05:49 AM 1KB
[PUTS] Summary PHP_7_1 r9aad380-NTS-X64 ostcpftt2 24/01/2017 05:47 AM 1KB
[PUTS] Summary PHP_Master r0877839-TS-X64 ostcpftt2 21/01/2017 05:32 PM 1KB
[PUTS] Summary PHP_7_1 r95406c8-NTS-X64 ostcpftt2 21/01/2017 05:28 PM 1KB
[PUTS] Summary PHP_Master r0311dc8-TS-X64 ostcpftt2 20/01/2017 04:12 AM 1KB
[PUTS] Summary PHP_7_1 r5e09031-NTS-X64 ostcpftt2 20/01/2017 04:08 AM 1KB
[PUTS] Summary PHP_Master r5bc8162-NTS-X64 ostcpftt2 19/01/2017 06:33 AM 1KB
[PUTS] Summary PHP_7_1 rfec3a65-TS-X64 ostcpftt2 19/01/2017 06:30 AM 1KB
[PUTS] Summary PHP_Master r7c17936-TS-X64 ostcpftt2 18/01/2017 08:14 PM 1KB
[PUTS] Summary PHP_Master rcc91b01-NTS-X64 ostcpftt2 18/01/2017 11:26 AM 1KB
[PUTS] Summary PHP_7_1 r429bfbd-TS-X64 ostcpftt2 18/01/2017 11:24 AM 1KB
[PUTS] Summary PHP_Master rcc91b01-TS-X64 ostcpftt2 18/01/2017 09:10 AM 1KB
[PUTS] Summary PHP_Master rfafce65-NTS-X64 ostcpftt2 18/01/2017 02:36 AM 1KB
[PUTS] Summary PHP_7_1 rabe094d-TS-X86 ostcpftt2 18/01/2017 02:36 AM 1KB
[PUTS] Summary PHP_Master rcbc416e-TS-X64 ostcpftt2 17/01/2017 04:53 PM 1KB
[PUTS] Summary PHP_7_1 r05f2f73-NTS-X64 ostcpftt2 17/01/2017 04:51 PM 1KB
[PUTS] Summary PHP_Master rcbc416e-NTS-X64 ostcpftt2 17/01/2017 11:03 AM 1KB
[PUTS] Summary PHP_7_1 r05f2f73-TS-X64 ostcpftt2 17/01/2017 10:59 AM 1KB
[PUTS] Summary PHP_Master r1a8ad8a-NTS-X64 ostcpftt2 14/01/2017 05:37 AM 1KB
[PUTS] Summary PHP_7_1 r19363de-NTS-X64 ostcpftt2 14/01/2017 05:34 AM 1KB
[PUTS] Summary PHP_Master rc4e0ba0-TS-X64 ostcpftt2 13/01/2017 08:39 PM 1KB
[PUTS] Summary PHP_7_1 re6632ce-TS-X64 ostcpftt2 13/01/2017 08:37 PM 1KB
[PUTS] Summary PHP_Master rec6b03a-NTS-X64 ostcpftt2 12/01/2017 09:42 PM 1KB
[PUTS] Summary PHP_7_1 r6fbd61a-NTS-X64 ostcpftt2 12/01/2017 09:40 PM 1KB
[PUTS] Summary PHP_Master r703c004-TS-X64 ostcpftt2 11/01/2017 09:29 AM 1KB
[PUTS] Summary PHP_7_1 rc7ef178-TS-X64 ostcpftt2 11/01/2017 09:24 AM 1KB
[PUTS] Summary PHP_7_1 raadc84f-TS-X64 ostcpftt2 10/01/2017 04:26 PM 1KB
[suspicious - maybe spam] [PUTS] Summary PHP_7_1 raadc84f-TS-X64 ostcpftt2 10/01/2017 03:17 PM 1KB
[PUTS] Summary PHP_7_1 r49d90dc-TS-X64 ostcpftt2 05/01/2017 11:32 AM 1KB
Possible bug in Make test avinash.murthy 28/12/2016 10:27 PM 1KB
Php test results laurik 25/12/2016 07:15 AM 1KB
[PUTS] Summary PHP_7_1 red0602f-NTS-X86 ostcpftt2 22/12/2016 08:43 PM 1KB
[PUTS] Summary PHP_7_1 r728502f-TS-X86 ostcpftt2 22/12/2016 05:54 PM 1KB
[PUTS] Summary PHP_7_1 r728502f-TS-X64 ostcpftt2 22/12/2016 03:07 PM 1KB
[PUTS] Summary PHP_7_1 red0602f-NTS-X64 ostcpftt2 22/12/2016 12:24 PM 1KB
[PUTS] Summary PHP_7_1 red0602f-TS-X64 ostcpftt2 22/12/2016 09:44 AM 1KB
[PUTS] Summary PHP_7_1 r6ffa1d2-NTS-X64 ostcpftt2 22/12/2016 06:56 AM 1KB
[PUTS] Summary PHP_7_1 r6ffa1d2-TS-X64 ostcpftt2 22/12/2016 04:15 AM 1KB
[PUTS] Summary PHP_7_1 r82988d3-TS-X86 ostcpftt2 22/12/2016 01:34 AM 1KB
[PUTS] Summary PHP_7_1 r82988d3-NTS-X64 ostcpftt2 21/12/2016 10:46 PM 1KB
[PUTS] Summary PHP_7_1 r82988d3-TS-X64 ostcpftt2 21/12/2016 08:05 PM 1KB
[PUTS] Summary PHP_7_1 r7e21462-TS-X86 ostcpftt2 21/12/2016 05:25 PM 1KB
[PUTS] Summary PHP_7_1 r7e21462-TS-X64 ostcpftt2 21/12/2016 02:39 PM 1KB
[PUTS] Summary PHP_7_1 r8b06b7e-TS-X86 ostcpftt2 21/12/2016 12:02 PM 1KB
[PUTS] Summary PHP_7_1 r8b06b7e-NTS-X64 ostcpftt2 21/12/2016 09:14 AM 1KB
[PUTS] Summary PHP_7_1 r8b06b7e-TS-X64 ostcpftt2 21/12/2016 06:33 AM 1KB
[PUTS] Summary PHP_7_1 r43cc3d7-NTS-X64 ostcpftt2 21/12/2016 03:55 AM 1KB
[PUTS] Summary PHP_7_1 r43cc3d7-TS-X64 ostcpftt2 21/12/2016 01:13 AM 1KB
[PUTS] Summary PHP_7_1 r21e2836-NTS-X86 ostcpftt2 20/12/2016 10:25 PM 1KB
[PUTS] Summary PHP_7_1 r21e2836-TS-X86 ostcpftt2 20/12/2016 07:37 PM 1KB
php_test_results_20161220_1004 lucissfer 20/12/2016 06:29 PM 1KB
[PUTS] Summary PHP_7_1 r21e2836-TS-X64 ostcpftt2 20/12/2016 04:50 PM 1KB
[PUTS] Summary PHP_7_1 r21e2836-NTS-X64 ostcpftt2 20/12/2016 02:07 PM 1KB
[PUTS] Summary PHP_7_1 r6ea4490-NTS-X86 ostcpftt2 20/12/2016 04:58 AM 1KB
[PUTS] Summary PHP_7_1 r6ea4490-TS-X86 ostcpftt2 20/12/2016 02:08 AM 1KB
[PUTS] Summary PHP_7_1 r6ea4490-NTS-X64 ostcpftt2 19/12/2016 11:20 PM 1KB
[PUTS] Summary PHP_7_1 r6ea4490-TS-X64 ostcpftt2 19/12/2016 08:37 PM 1KB
[PUTS] Summary PHP_7_1 r8adc86a-TS-X86 ostcpftt2 19/12/2016 05:56 PM 1KB
[PUTS] Summary PHP_7_1 r8adc86a-TS-X64 ostcpftt2 19/12/2016 03:10 PM 1KB
[PUTS] Summary PHP_7_1 r8adc86a-NTS-X64 ostcpftt2 19/12/2016 12:26 PM 1KB
[PUTS] Summary PHP_7_1 rf077ada-TS-X64 ostcpftt2 19/12/2016 09:45 AM 1KB
[PUTS] Summary PHP_7_1 r7371c46-NTS-X64 ostcpftt2 19/12/2016 07:06 AM 1KB
[PUTS] Summary PHP_7_1 r4ef4e34-TS-X64 ostcpftt2 19/12/2016 04:19 AM 1KB
[PUTS] Summary PHP_7_1 r7d404bc-NTS-X64 ostcpftt2 19/12/2016 01:39 AM 1KB
[PUTS] Summary PHP_7_1 r59bf7f9-NTS-X86 ostcpftt2 18/12/2016 08:47 PM 1KB
[PUTS] Summary PHP_7_1 r59bf7f9-TS-X86 ostcpftt2 18/12/2016 05:58 PM 1KB
[PUTS] Summary PHP_7_1 r59bf7f9-TS-X64 ostcpftt2 18/12/2016 03:06 PM 1KB
[PUTS] Summary PHP_7_1 r59bf7f9-NTS-X64 ostcpftt2 18/12/2016 12:25 PM 1KB
[PUTS] Summary PHP_7_1 rf86e077-TS-X64 ostcpftt2 18/12/2016 09:42 AM 1KB
[PUTS] Summary PHP_7_1 raa84808-TS-X86 ostcpftt2 18/12/2016 06:58 AM 1KB
[PUTS] Summary PHP_7_1 ra9e0705-NTS-X64 ostcpftt2 18/12/2016 04:11 AM 1KB
[PUTS] Summary PHP_7_1 raa84808-TS-X64 ostcpftt2 18/12/2016 01:32 AM 1KB
[PUTS] Summary PHP_7_1 ra3a8cc6-NTS-X64 ostcpftt2 17/12/2016 10:50 PM 1KB
[PUTS] Summary PHP_7_1 rc104f09-NTS-X86 ostcpftt2 17/12/2016 06:06 PM 1KB
[PUTS] Summary PHP_7_1 rc104f09-TS-X86 ostcpftt2 17/12/2016 03:18 PM 1KB
[PUTS] Summary PHP_7_1 rc104f09-TS-X64 ostcpftt2 17/12/2016 12:42 PM 1KB
[PUTS] Summary PHP_7_1 rc104f09-NTS-X64 ostcpftt2 17/12/2016 10:07 AM 1KB
[PUTS] Summary PHP_7_1 rb91d7f1-NTS-X64 ostcpftt2 17/12/2016 05:00 AM 1KB
[PUTS] Summary PHP_7_1 r8ba7878-TS-X86 ostcpftt2 16/12/2016 05:49 PM 1KB
[PUTS] Summary PHP_7_1 r8ba7878-TS-X64 ostcpftt2 16/12/2016 03:14 PM 1KB
[PUTS] Summary PHP_7_1 rb441ff6-NTS-X86 ostcpftt2 16/12/2016 12:43 PM 1KB
[PUTS] Summary PHP_7_1 rb441ff6-TS-X86 ostcpftt2 16/12/2016 10:08 AM 1KB
[PUTS] Summary PHP_7_1 r76c4a3d-NTS-X86 ostcpftt2 07/12/2016 05:09 PM 1KB
[PUTS] Summary PHP_7_1 r76c4a3d-TS-X64 ostcpftt2 07/12/2016 02:12 PM 1KB
[PUTS] Summary PHP_7_1 r76c4a3d-TS-X86 ostcpftt2 07/12/2016 11:29 AM 1KB
[PUTS] Summary PHP_7_1 rd7e7f74-TS-X64 ostcpftt2 07/12/2016 08:43 AM 1KB
[PUTS] Summary PHP_7_1 r43f88f2-TS-X86 ostcpftt2 07/12/2016 05:52 AM 1KB
[PUTS] Summary PHP_7_1 r308cc2e-TS-X64 ostcpftt2 07/12/2016 02:59 AM 1KB
[PUTS] Summary PHP_7_1 r72891f3-NTS-X86 ostcpftt2 07/12/2016 12:18 AM 1KB
[PUTS] Summary PHP_7_1 r72891f3-TS-X86 ostcpftt2 06/12/2016 09:34 PM 1KB
[PUTS] Summary PHP_7_1 r547b735-NTS-X64 ostcpftt2 06/12/2016 06:51 PM 1KB
[PUTS] Summary PHP_7_1 r3b79f8f-TS-X86 ostcpftt2 06/12/2016 12:31 PM 1KB
[PUTS] Summary PHP_7_1 r3b79f8f-TS-X64 ostcpftt2 06/12/2016 09:52 AM 1KB
[PUTS] Summary PHP_7_1 r2f0e61f-NTS-X64 ostcpftt2 06/12/2016 07:15 AM 1KB
[PUTS] Summary PHP_7_1 r8ad9043-NTS-X86 ostcpftt2 05/12/2016 06:23 PM 1KB
[PUTS] Summary PHP_7_1 r8ad9043-TS-X86 ostcpftt2 05/12/2016 03:42 PM 1KB
[PUTS] Summary PHP_7_1 r8ad9043-TS-X64 ostcpftt2 05/12/2016 01:06 PM 1KB
[PUTS] Summary PHP_7_1 r8ad9043-NTS-X64 ostcpftt2 05/12/2016 10:32 AM 1KB
[PUTS] Summary PHP_7_1 r69c3859-TS-X64 ostcpftt2 05/12/2016 07:52 AM 1KB
[PUTS] Summary PHP_7_1 r2198ce2-TS-X86 ostcpftt2 05/12/2016 05:18 AM 1KB
[PUTS] Summary PHP_7_1 rdfd776b-TS-X64 ostcpftt2 05/12/2016 02:42 AM 1KB
[PUTS] Summary PHP_7_1 re34c828-TS-X86 ostcpftt2 05/12/2016 12:07 AM 1KB
[PUTS] Summary PHP_7_1 re34c828-NTS-X64 ostcpftt2 04/12/2016 09:28 PM 1KB
[PUTS] Summary PHP_7_1 r146b68e-NTS-X86 ostcpftt2 04/12/2016 04:49 PM 1KB
[PUTS] Summary PHP_7_1 rca871aa-TS-X86 ostcpftt2 04/12/2016 02:12 PM 1KB
[PUTS] Summary PHP_7_1 rca871aa-TS-X64 ostcpftt2 04/12/2016 11:37 AM 1KB
[PUTS] Summary PHP_7_1 r146b68e-NTS-X64 ostcpftt2 04/12/2016 09:03 AM 1KB
[PUTS] Summary PHP_7_1 r146b68e-TS-X64 ostcpftt2 04/12/2016 06:30 AM 1KB
[PUTS] Summary PHP_7_1 rc20299d-NTS-X64 ostcpftt2 04/12/2016 04:01 AM 1KB
[PUTS] Summary PHP_7_1 rc20299d-TS-X64 ostcpftt2 04/12/2016 01:27 AM 1KB
[PUTS] Summary PHP_7_1 r0b204d6-TS-X86 ostcpftt2 03/12/2016 10:53 PM 1KB
[PUTS] Summary PHP_7_1 r0b204d6-TS-X64 ostcpftt2 03/12/2016 08:10 PM 1KB
[PUTS] Summary PHP_7_1 r0b204d6-NTS-X64 ostcpftt2 03/12/2016 05:35 PM 1KB
[PUTS] Summary PHP_7_1 r91d365f-NTS-X86 ostcpftt2 03/12/2016 12:52 PM 1KB
[PUTS] Summary PHP_7_1 r91d365f-TS-X86 ostcpftt2 03/12/2016 10:11 AM 1KB
[PUTS] Summary PHP_7_1 r91d365f-NTS-X64 ostcpftt2 03/12/2016 07:33 AM 1KB
[PUTS] Summary PHP_7_1 r91d365f-TS-X64 ostcpftt2 03/12/2016 04:54 AM 1KB
[PUTS] Summary PHP_7_1 rb3a4de6-NTS-X64 ostcpftt2 03/12/2016 02:17 AM 1KB
[PUTS] Summary PHP_7_1 raf2d47c-TS-X64 ostcpftt2 02/12/2016 11:44 PM 1KB
[PUTS] Summary PHP_7_1 r04500f1-TS-X86 ostcpftt2 02/12/2016 09:08 PM 1KB
[PUTS] Summary PHP_7_1 rad5038b-NTS-X86 ostcpftt2 02/12/2016 09:49 AM 1KB
[PUTS] Summary PHP_7_1 rad5038b-TS-X86 ostcpftt2 02/12/2016 07:15 AM 1KB
[PUTS] Summary PHP_7_1 rad5038b-TS-X64 ostcpftt2 02/12/2016 04:41 AM 1KB
[PUTS] Summary PHP_7_1 rad5038b-NTS-X64 ostcpftt2 02/12/2016 02:05 AM 1KB
[PUTS] Summary PHP_7_1 r8ecbb66-TS-X64 ostcpftt2 01/12/2016 11:31 PM 1KB
[PUTS] Summary PHP_7_1 r54f7abf-TS-X86 ostcpftt2 01/12/2016 08:58 PM 1KB
[PUTS] Summary PHP_7_1 r60c875b-TS-X64 ostcpftt2 01/12/2016 06:20 PM 1KB
[PUTS] Summary PHP_7_1 r7aaa1a8-TS-X86 ostcpftt2 30/11/2016 06:27 PM 1KB
[PUTS] Summary PHP_7_1 r7aaa1a8-TS-X64 ostcpftt2 30/11/2016 03:47 PM 1KB
[PUTS] Summary PHP_7_1 r7aaa1a8-NTS-X64 ostcpftt2 30/11/2016 01:11 PM 1KB
[PUTS] Summary PHP_7_1 rcabcf89-NTS-X86 ostcpftt2 30/11/2016 04:11 AM 1KB
[PUTS] Summary PHP_7_1 rcabcf89-TS-X86 ostcpftt2 30/11/2016 01:28 AM 1KB
[PUTS] Summary PHP_7_1 rcabcf89-NTS-X64 ostcpftt2 29/11/2016 10:46 PM 1KB
[PUTS] Summary PHP_7_1 rcabcf89-TS-X64 ostcpftt2 29/11/2016 08:06 PM 1KB
FAILED MAKE TEST florian.sibille 28/11/2016 08:44 PM 1KB
[PUTS] Summary PHP_7_1 rb10de2f-TS-X64 ostcpftt2 22/11/2016 03:09 PM 1KB
[PUTS] Summary PHP_7_1 rf574d78-TS-X86 ostcpftt2 22/11/2016 12:34 PM 1KB
[PUTS] Summary PHP_7_1 r2f5e49b-NTS-X64 ostcpftt2 22/11/2016 09:59 AM 1KB
[PUTS] Summary PHP_7_1 r50e60e8-NTS-X64 ostcpftt2 21/11/2016 03:20 PM 1KB
[PUTS] Summary PHP_7_1 rf284479-TS-X86 ostcpftt2 21/11/2016 10:44 AM 1KB
[PUTS] Summary PHP_7_1 rf284479-NTS-X86 ostcpftt2 21/11/2016 08:11 AM 1KB
[PUTS] Summary PHP_7_1 r110a6cc-TS-X86 ostcpftt2 21/11/2016 05:40 AM 1KB
[PUTS] Summary PHP_7_1 rb7fee22-NTS-X64 ostcpftt2 21/11/2016 03:09 AM 1KB
[PUTS] Summary PHP_7_1 rb7fee22-TS-X64 ostcpftt2 21/11/2016 12:41 AM 1KB
[PUTS] Summary PHP_7_1 r40da843-NTS-X86 ostcpftt2 20/11/2016 10:12 PM 1KB
[PUTS] Summary PHP_7_1 r40da843-TS-X86 ostcpftt2 20/11/2016 07:41 PM 1KB
[PUTS] Summary PHP_7_1 r56f9a93-NTS-X64 ostcpftt2 20/11/2016 05:11 PM 1KB
[PUTS] Summary PHP_7_1 rc7d0571-NTS-X86 ostcpftt2 19/11/2016 05:28 PM 1KB
[PUTS] Summary PHP_7_1 rc7d0571-TS-X86 ostcpftt2 19/11/2016 02:57 PM 1KB
[PUTS] Summary PHP_7_1 rc7d0571-NTS-X64 ostcpftt2 19/11/2016 12:29 PM 1KB
[PUTS] Summary PHP_7_1 rc7d0571-TS-X64 ostcpftt2 19/11/2016 10:05 AM 1KB
[PUTS] Summary PHP_7_1 r828f866-NTS-X64 ostcpftt2 19/11/2016 07:46 AM 1KB
PHP 7.0.13 Test Results shanley 17/11/2016 07:07 AM 1KB
[PUTS] Summary PHP_7_1 r59f2f14-TS-X64 ostcpftt2 09/11/2016 12:55 AM 1KB
[PUTS] Summary PHP_7_1 r9b81342-NTS-X64 ostcpftt2 08/11/2016 09:51 PM 1KB
[PUTS] Summary PHP_7_1 red12167-TS-X64 ostcpftt2 08/11/2016 06:49 PM 1KB
[PUTS] Summary PHP_7_1 red12167-TS-X86 ostcpftt2 08/11/2016 03:44 PM 1KB
[PUTS] Summary PHP_7_1 r271a593-TS-X64 ostcpftt2 08/11/2016 12:35 PM 1KB
[PUTS] Summary PHP_7_1 r271a593-NTS-X64 ostcpftt2 08/11/2016 09:26 AM 1KB
[PUTS] Summary PHP_7_1 r69a3659-TS-X64 ostcpftt2 08/11/2016 06:24 AM 1KB
[PUTS] Summary PHP_7_1 r43df063-NTS-X86 ostcpftt2 08/11/2016 03:22 AM 1KB
[PUTS] Summary PHP_7_1 re161b0f-TS-X86 ostcpftt2 08/11/2016 12:18 AM 1KB
[PUTS] Summary PHP_7_1 rd73af63-NTS-X64 ostcpftt2 05/11/2016 10:32 AM 1KB
[PUTS] Summary PHP_7_1 r86ae78d-TS-X64 ostcpftt2 05/11/2016 07:43 AM 1KB
[PUTS] Summary PHP_7_1 r0bc6592-TS-X64 ostcpftt2 04/11/2016 11:42 AM 1KB
[PUTS] Summary PHP_7_1 r0bc6592-TS-X86 ostcpftt2 04/11/2016 09:04 AM 1KB
PHP make-test Results Report mws.nth 31/10/2016 01:11 PM 1KB
[PUTS] Summary PHP_7_1 r97fc6aa-TS-X64 ostcpftt2 31/10/2016 11:23 AM 1KB
[PUTS] Summary PHP_7_1 r5c793bf-NTS-X86 ostcpftt2 31/10/2016 08:33 AM 1KB
[PUTS] Summary PHP_7_1 rbe6bf71-TS-X64 ostcpftt2 30/10/2016 07:55 AM 1KB
[PUTS] Summary PHP_7_1 rbe6bf71-NTS-X64 ostcpftt2 30/10/2016 07:30 AM 1KB
[PUTS] Summary PHP_7_1 rbdd3fec-TS-X64 ostcpftt2 26/10/2016 09:57 AM 1KB
[PUTS] Summary PHP_7_1 r0d2084b-TS-X64 ostcpftt2 26/10/2016 05:43 AM 1KB
[PUTS] Summary PHP_7_1 r4e3eb4a-TS-X86 ostcpftt2 27/10/2016 12:18 PM 1KB
7.0.12 Test Results shanley 22/10/2016 04:49 AM 1KB
make test report attached eric.r.gallagher 20/10/2016 02:37 AM 1KB
I may have found a problem in PHP clemens.buschmann 19/10/2016 11:04 PM 1KB
I may have found a problem in PHP clemens.buschmann 19/10/2016 09:35 PM 1KB
[PUTS] Summary PHP_7_1 rea83e50-TS-X64 ostcpftt 07/10/2016 02:18 PM 1KB
[PUTS] Summary PHP_7_1 rbc5efe5-TS-X64 ostcpftt 07/10/2016 11:46 AM 1KB
[PUTS] Summary PHP_7_1 rbc5efe5-TS-X86 ostcpftt 07/10/2016 08:38 AM 1KB
[PUTS] Summary PHP_7_1 rea83e50-NTS-X64 ostcpftt 07/10/2016 05:34 AM 1KB
[PUTS] Summary PHP_7_1 rea83e50-TS-X86 ostcpftt 07/10/2016 02:28 AM 1KB
[PUTS] Summary PHP_7_1 rbc5efe5-NTS-X86 ostcpftt 07/10/2016 12:02 AM 1KB
[PUTS] Summary PHP_7_1 rbc5efe5-TS-X86 ostcpftt 06/10/2016 09:06 PM 1KB
[PUTS] Summary PHP_7_1 r5b79e95-TS-X64 ostcpftt 06/10/2016 06:03 PM 1KB
[PUTS] Summary PHP_7_1 r5b79e95-TS-X64 ostcpftt 06/10/2016 03:38 PM 1KB
[PUTS] Summary PHP_7_1 r5005963-NTS-X86 ostcpftt 06/10/2016 01:13 PM 1KB
[PUTS] Summary PHP_7_1 r5005963-NTS-X64 ostcpftt 06/10/2016 12:44 PM 1KB
[PUTS] Summary PHP_7_1 r5005963-TS-X64 ostcpftt 06/10/2016 09:48 AM 1KB
[PUTS] Summary PHP_7_1 rd5b77d6-TS-X86 ostcpftt 06/10/2016 06:52 AM 1KB
[PUTS] Summary PHP_7_1 rd5b77d6-NTS-X64 ostcpftt 06/10/2016 03:53 AM 1KB
[PUTS] Summary PHP_7_1 rd5b77d6-TS-X64 ostcpftt 06/10/2016 12:54 AM 1KB
[PUTS] Summary PHP_7_1 rabfd811-TS-X86 ostcpftt 05/10/2016 09:50 PM 1KB
[PUTS] Summary PHP_7_1 r56e19b7-TS-X64 ostcpftt 05/10/2016 06:50 PM 1KB
[PUTS] Summary PHP_7_1 rcc2a0dd-NTS-X86 ostcpftt 05/10/2016 03:56 PM 1KB
[PUTS] Summary PHP_7_1 rcc2a0dd-TS-X86 ostcpftt 05/10/2016 03:28 PM 1KB
[PUTS] Summary PHP_7_1 rcc2a0dd-TS-X64 ostcpftt 05/10/2016 03:00 PM 1KB
[PUTS] Summary PHP_7_1 rcc2a0dd-NTS-X64 ostcpftt 05/10/2016 02:33 PM 1KB
php 7.0.11 make test report robert 04/10/2016 02:05 AM 1KB
[PUTS] Summary PHP_7_1 r228be4c-NTS-X86 ostcpftt 27/09/2016 02:05 PM 1KB
[PUTS] Summary PHP_7_1 r228be4c-TS-X64 ostcpftt 27/09/2016 01:34 PM 1KB
[PUTS] Summary PHP_7_1 r228be4c-NTS-X64 ostcpftt 27/09/2016 10:29 AM 1KB
[PUTS] Summary PHP_7_1 rb4e90e9-TS-X64 ostcpftt 27/09/2016 07:20 AM 1KB
PHP 7.0.11 Make Test Results Brandon.Tanner 25/09/2016 12:06 AM 1KB
php 'make test' failed pzn 21/09/2016 01:33 AM 1KB
PHP 7.0.11 test report(may found a problem in PHP) littlechoatcht 20/09/2016 09:56 AM 1KB
NULL pointer access in pthreads/src/globals.c maximalmin 19/09/2016 04:44 PM 1KB
[PUTS] Summary PHP_7_1 rd185c2f-NTS-X86 ostcpftt 17/09/2016 10:43 PM 1KB
[PUTS] Summary PHP_7_1 rd185c2f-NTS-X86 ostcpftt 17/09/2016 09:38 PM 1KB
[PUTS] Summary PHP_7_1 rd185c2f-NTS-X86 ostcpftt 17/09/2016 07:08 PM 1KB
[PUTS] Summary PHP_7_1 rd185c2f-NTS-X86 ostcpftt 17/09/2016 04:36 PM 1KB
[PUTS] Summary PHP_7_1 rd185c2f-NTS-X86 ostcpftt 17/09/2016 02:05 PM 1KB
[PUTS] Summary PHP_7_1 rd185c2f-NTS-X86 ostcpftt 17/09/2016 11:23 AM 1KB
[PUTS] Summary PHP_7_1 rd185c2f-NTS-X86 ostcpftt 17/09/2016 08:45 AM 1KB
[PUTS] Summary PHP_7_1 rd185c2f-NTS-X86 ostcpftt 17/09/2016 06:05 AM 1KB
[PUTS] Summary PHP_7_1 rd185c2f-NTS-X86 ostcpftt 17/09/2016 03:23 AM 1KB
[PUTS] Summary PHP_7_1 rd185c2f-NTS-X86 ostcpftt 17/09/2016 12:49 AM 1KB
[PUTS] Summary PHP_7_1 rd185c2f-NTS-X86 ostcpftt 16/09/2016 10:14 PM 1KB
[PUTS] Summary PHP_7_1 rd185c2f-NTS-X86 ostcpftt 16/09/2016 07:21 PM 1KB
[PUTS] Summary PHP_7_1 rd185c2f-NTS-X86 ostcpftt 16/09/2016 04:53 PM 1KB
[PUTS] Summary PHP_7_1 rd185c2f-NTS-X86 ostcpftt 16/09/2016 02:26 PM 1KB
[PUTS] Summary PHP_7_1 rd185c2f-NTS-X86 ostcpftt 16/09/2016 11:37 AM 1KB
[PUTS] Summary PHP_7_1 rd185c2f-NTS-X86 ostcpftt 16/09/2016 09:09 AM 1KB
[PUTS] Summary PHP_7_1 rd185c2f-NTS-X86 ostcpftt 16/09/2016 06:38 AM 1KB
PHP 7.0.11 Test Results shanley 16/09/2016 06:04 AM 1KB
[PUTS] Summary PHP_7_1 rd185c2f-NTS-X86 ostcpftt 16/09/2016 03:52 AM 1KB
[PUTS] Summary PHP_7_1 rd185c2f-NTS-X86 ostcpftt 16/09/2016 01:17 AM 1KB
[PUTS] Summary PHP_7_1 rd185c2f-NTS-X86 ostcpftt 15/09/2016 07:56 PM 1KB
[PUTS] Summary PHP_7_1 rd185c2f-NTS-X86 ostcpftt 15/09/2016 05:33 PM 1KB
[PUTS] Summary PHP_7_1 r9650b8e-NTS-X86 ostcpftt 15/09/2016 03:09 PM 1KB
[PUTS] Summary PHP_7_1 r5f9fe06-TS-X86 ostcpftt 15/09/2016 12:27 PM 1KB
[PUTS] Summary PHP_7_1 rf203de0-NTS-X64 ostcpftt 15/09/2016 09:48 AM 1KB
make test error logoyaho 05/09/2016 09:47 PM 1KB
[PUTS] Summary PHP_7_1 rdefa47b-NTS-X86 ostcpftt 05/09/2016 05:07 PM 1KB
[PUTS] Summary PHP_7_1 r3bfd060-NTS-X64 ostcpftt 05/09/2016 01:54 PM 1KB
[PUTS] Summary PHP_7_1 r94b66b8-NTS-X86 ostcpftt 05/09/2016 10:54 AM 1KB
[PUTS] Summary PHP_7_1 r94b66b8-NTS-X64 ostcpftt 05/09/2016 07:44 AM 1KB
[PUTS] Summary PHP_7_1 r69f0d3d-TS-X64 ostcpftt 05/09/2016 04:41 AM 1KB
[PUTS] Summary PHP_7_1 r69f0d3d-TS-X86 ostcpftt 05/09/2016 01:40 AM 1KB
[PUTS] Summary PHP_7_1 r1ae2d07-TS-X64 ostcpftt 04/09/2016 10:19 PM 1KB
[PUTS] Summary PHP_7_1 r1ae2d07-TS-X64 ostcpftt 04/09/2016 07:28 PM 1KB
[PUTS] Summary PHP_7_1 rf1bfd7f-NTS-X86 ostcpftt 04/09/2016 04:55 PM 1KB
[PUTS] Summary PHP_7_1 rf1bfd7f-NTS-X64 ostcpftt 04/09/2016 01:46 PM 1KB
[PUTS] Summary PHP_7_1 r85824ed-TS-X64 ostcpftt 04/09/2016 10:50 AM 1KB