news.mozilla.org/mozilla.dev.builds    Page: (300) [Reload] [Post] [OE] [Favorites] [Ranking] [Next]
Subject From Date Size
Cross-Compile Firefox 56.02 on Ubuntu for Windows oceanl 17/06/2020 09:30 AM 1KB
   Re: Cross-Compile Firefox 56.02 on Ubuntu for Windows Tom Ritter 17/06/2020 09:54 PM 1KB
     Re: Cross-Compile Firefox 56.02 on Ubuntu for Windows oceanl 18/06/2020 05:38 AM 2KB
       Re: Cross-Compile Firefox 56.02 on Ubuntu for Windows Tom Ritter 19/06/2020 11:26 PM 2KB
Help with Cross-Compile Firefox 68 on Ubuntu 16.04 for Windows Linker Error oceanl 11/06/2020 10:13 AM 7KB
   Re: Help with Cross-Compile Firefox 68 on Ubuntu 16.04 for Windows Linker Error Tom Ritter 11/06/2020 10:48 PM 2KB
     Re: Help with Cross-Compile Firefox 68 on Ubuntu 16.04 for Windows Linker Error oceanlantern 12/06/2020 07:07 AM 2KB
       Re: Help with Cross-Compile Firefox 68 on Ubuntu 16.04 for Windows Linker Error oceanlantern 12/06/2020 11:59 PM 3KB
         Re: Help with Cross-Compile Firefox 68 on Ubuntu 16.04 for Windows Linker Error Tom Ritter 13/06/2020 12:42 AM 2KB
           Re: Help with Cross-Compile Firefox 68 on Ubuntu 16.04 for Windows Linker Error oceanl 13/06/2020 04:27 AM 2KB
     Re: Help with Cross-Compile Firefox 68 on Ubuntu 16.04 for Windows Linker Error oceanl 13/06/2020 04:21 AM 2KB
Video player slow en pdf reader bad. skybuck2000 08/05/2020 11:38 AM 1KB
Some very basic cross build questions mdenber 28/03/2020 12:52 AM 3KB
Filter out websites with cookie terror. skybuck2000 01/03/2020 01:06 PM 1KB
Intellisense working in VS2019 markdosborne 27/02/2020 10:06 PM 1KB
Re: Intellisense working in VS2019 Nicholas Alexander 28/02/2020 01:01 AM 6KB
   Re: Intellisense working in VS2019 markdosborne 29/02/2020 03:00 PM 6KB
build fails because it cannot find autoconf.mk (New) jacquelinewaichan 22/02/2020 06:23 AM 2KB
Re: build fails because it cannot find autoconf.mk (New) Botond Ballo 22/02/2020 06:38 AM 4KB
   Re: build fails because it cannot find autoconf.mk (New) jacquelinewaichan 22/02/2020 11:59 AM 3KB
Re: build fails because it cannot find autoconf.mk (New) Botond Ballo 22/02/2020 01:12 PM 4KB
Upgrading from Node 8 to Node 10 this week dmosedale 12/02/2020 04:31 AM 1KB
   Node 10 now required on mozilla-central; please run `mach bootstrap`(was Re: Upgrading from Node 8 to Node 10 this week) dmosedale 16/02/2020 12:14 AM 1KB
Testing a change Sanchit Arora 05/02/2020 05:58 PM 1KB
Re: Testing a change Botond Ballo 05/02/2020 09:20 PM 4KB
Problem in building firefox (Ubuntu 16.04) Freya Mehta 31/01/2020 08:18 PM 38KB
Re: Problem in building firefox (Ubuntu 16.04) Botond Ballo 31/01/2020 10:14 PM 42KB
   Re: Problem in building firefox (Ubuntu 16.04) Freya Mehta 31/01/2020 10:20 PM 40KB
Re: Problem in building firefox (Ubuntu 16.04) Mike Hommey 31/01/2020 10:27 PM 11KB
   Re: Problem in building firefox (Ubuntu 16.04) Freya Mehta 31/01/2020 10:37 PM 12KB
Re: Problem in building firefox (Ubuntu 16.04) Botond Ballo 31/01/2020 11:05 PM 4KB
Re: Problem in building firefox (Ubuntu 16.04) Mike Hommey 31/01/2020 11:11 PM 14KB
   Re: Problem in building firefox (Ubuntu 16.04) Freya Mehta 02/02/2020 07:30 PM 13KB
Re: Problem in building firefox (Ubuntu 16.04) ISHIKAWA,chiaki 31/01/2020 11:59 PM 4KB
Finding Bugs Sanchit Arora 20/01/2020 12:41 AM 1KB
Re: Finding Bugs Justin Wood 20/01/2020 03:53 AM 6KB
Submitting Patch sanchit.arora.2002 18/01/2020 03:32 AM 1KB
Re: Submitting Patch Dustin Mitchell 18/01/2020 03:50 AM 8KB
LIMIT WEBSITE MEMORY USAGE TO 100 MEGABYTES skybuck2000 16/01/2020 08:14 PM 1KB
Good First Bugs sanchit.arora.2002 16/01/2020 08:06 PM 1KB
Re: Good First Bugs Dustin Mitchell 16/01/2020 09:48 PM 7KB
Problem in Building Firefox (Ubuntu 19.04) sanchit.arora.2002 13/01/2020 07:08 PM 1KB
Re: Problem in Building Firefox (Ubuntu 19.04) Andreas Tolfsen 13/01/2020 07:15 PM 5KB
   Re: Problem in Building Firefox (Ubuntu 19.04) sanchit.arora.2002 13/01/2020 09:53 PM 2KB
firefox build failure Dave 12/01/2020 09:30 AM 2KB
Re: firefox build failure Botond Ballo 12/01/2020 10:05 AM 4KB
   Re: firefox build failure Dave 12/01/2020 10:42 AM 11KB
Re: firefox build failure Botond Ballo 12/01/2020 10:55 AM 4KB
   Re: firefox build failure Dave 12/01/2020 11:19 AM 14KB
Re: firefox build failure Botond Ballo 12/01/2020 11:44 AM 5KB
   Re: firefox build failure Dave 12/01/2020 11:49 AM 2KB
Cross compiling for Solaris SPARC on Ubuntu mdenber 08/01/2020 03:31 AM 2KB
   Re: Cross compiling for Solaris SPARC on Ubuntu mdenber 01/03/2020 04:04 AM 3KB
Firefox 71 build hangs in Ubuntu while compiling style mdenber 06/01/2020 06:30 AM 1KB
Re: Firefox 71 build hangs in Ubuntu while compiling style Botond Ballo 06/01/2020 06:38 AM 5KB
   Re: Firefox 71 build hangs in Ubuntu while compiling style mdenber 07/01/2020 04:44 AM 1KB
please run mach bootstrap; NodeJS/NPM security updates landed Dan Mosedale 19/12/2019 11:23 PM 1KB
NodeJS vendoring policies; feedback requested Dan Mosedale 22/11/2019 05:39 AM 2KB
I BEGIN TO GET COOKY-SICK skybuck2000 03/11/2019 02:40 AM 1KB
Cross compiling for Windows on Ubuntu kultye 20/10/2019 05:11 AM 1KB
Re: Cross compiling for Windows on Ubuntu Georg Koppen 25/10/2019 02:10 PM 10KB
   Re: Cross compiling for Windows on Ubuntu kultye 26/10/2019 12:11 AM 2KB
     Re: Cross compiling for Windows on Ubuntu Tom Ritter 26/10/2019 04:19 AM 2KB
       Re: Cross compiling for Windows on Ubuntu kultye 26/10/2019 10:07 PM 2KB
         Re: Cross compiling for Windows on Ubuntu Tom Ritter 31/10/2019 04:00 AM 1KB
           Re: Cross compiling for Windows on Ubuntu kultye 31/10/2019 09:53 PM 2KB
             Re: Cross compiling for Windows on Ubuntu Tom Ritter 31/10/2019 11:06 PM 2KB
               Re: Cross compiling for Windows on Ubuntu kultye 01/11/2019 06:21 AM 3KB
                 Re: Cross compiling for Windows on Ubuntu Tom Ritter 01/11/2019 10:59 PM 4KB
                   Re: Cross compiling for Windows on Ubuntu kultye 01/11/2019 11:13 PM 4KB
                   Re: Cross compiling for Windows on Ubuntu Tom Ritter 01/11/2019 11:16 PM 1KB
                     Re: Cross compiling for Windows on Ubuntu kultye 04/11/2019 10:00 PM 2KB
Build Firefox 65 failed after install the latest Mozilla build tool Erxin Shang 10/10/2019 09:21 PM 7KB
   Re: Build Firefox 65 failed after install the latest Mozilla build tool Erxin Shang 11/10/2019 11:29 AM 3KB
build without devtools masood.ax 26/08/2019 07:26 PM 1KB
font display issues with freshly built firefox Jon Leighton 05/08/2019 06:14 AM 1KB
   Re: font display issues with freshly built firefox Jon Leighton 05/08/2019 06:35 AM 1KB
Re: font display issues with freshly built firefox L. David Baron 07/08/2019 12:17 AM 5KB
   Re: font display issues with freshly built firefox Jon Leighton 07/08/2019 03:17 AM 1KB
Outdated german easy build instructions page sunrisechain 19/07/2019 03:23 PM 1KB
   Re: Outdated german easy build instructions page sunrisechain 19/07/2019 03:45 PM 1KB
   Re: Outdated german easy build instructions page sunrisechain 23/07/2019 02:26 AM 1KB
Windows build dependency on 8.3 short names Paul Schauble 01/07/2019 12:15 PM 2KB
Re: Windows build dependency on 8.3 short names Botond Ballo 01/07/2019 12:34 PM 6KB
   Re: Windows build dependency on 8.3 short names Paul Schauble 02/07/2019 10:57 AM 2KB
Re: Windows build dependency on 8.3 short names Nathan Froyd 02/07/2019 09:19 PM 5KB
Simple Thunderbird build says it's wrong, what's right? Paul Schauble 14/06/2019 07:15 AM 2KB
   Re: Simple Thunderbird build says it's wrong, what's right? Boris Zbarsky 14/06/2019 12:27 PM 3KB
     Re: Simple Thunderbird build says it's wrong, what's right? Axel Hecht 14/06/2019 04:53 PM 3KB
       Re: Simple Thunderbird build says it's wrong, what's right? Paul Schauble 16/06/2019 06:28 PM 4KB
         Re: Simple Thunderbird build says it's wrong, what's right? Axel Hecht 16/06/2019 09:44 PM 4KB
           Re: Simple Thunderbird build says it's wrong, what's right? Paul Schauble 17/06/2019 06:39 AM 4KB
no matching function error in /mozilla-central/comm/mailnews/addrbook/src/nsAbLDAPListenerBase.cpp Aashlay Singla 13/06/2019 06:56 PM 8KB
   Re: no matching function error in /mozilla-central/comm/mailnews/addrbook/src/nsAbLDAPListenerBase.cpp Boris Zbarsky 13/06/2019 10:46 PM 1KB
Can't type properly in latest firefox build, constant triggering of short cut keys. skybuck2000 10/06/2019 08:48 PM 1KB
Proposal: Move node from 8.11 to 10.15 and npm to 6.4 lsmyth 01/05/2019 02:23 AM 2KB
Re: Proposal: Move node from 8.11 to 10.15 and npm to 6.4 Nathan Froyd 01/05/2019 09:41 PM 7KB
Any Suggestions for Tools and Environment for Mozilla Development Na 01/02/2019 12:49 PM 1KB
Feature Request: Sort bookmarks on date and time. skybuck2000 01/02/2019 12:39 PM 1KB
   Re: Feature Request: Sort bookmarks on bookmark number (addition order) skybuck2000 01/02/2019 12:53 PM 2KB
     Re: Feature Request: Sort bookmarks on bookmark number (addition order) skybuck2000 01/02/2019 12:55 PM 1KB
     Re: Feature Request: Sort bookmarks on bookmark number (addition order) skybuck2000 01/02/2019 12:59 PM 1KB
Build fails with inability to find inttypes.h Greg Lutz 29/01/2019 04:30 AM 2KB
Re: Build fails with inability to find inttypes.h Bobby Holley 29/01/2019 04:43 AM 10KB
   Re: Build fails with inability to find inttypes.h Greg Lutz 30/01/2019 04:47 AM 4KB
Thunderbird build fails "Cannot stat ../../../dist/bin/thunderbird" Mac Shout 12/01/2019 04:23 AM 3KB
Build Fails on cbindgen Error Chris 30/12/2018 08:43 AM 7KB
Re: Build Fails on cbindgen Error Bobby Holley 30/12/2018 08:48 AM 19KB
   Re: Build Fails on cbindgen Error Chris 30/12/2018 02:04 PM 16KB
Re: Build Fails on cbindgen Error Bobby Holley 31/12/2018 01:44 AM 41KB
Building Firefox for Debian:Jessie Andrey Lushnikov 01/12/2018 09:20 AM 1KB
Re: Building Firefox for Debian:Jessie Botond Ballo 01/12/2018 09:30 AM 4KB
   Re: Building Firefox for Debian:Jessie npierron 05/12/2018 04:53 AM 1KB
Straw man mozilla-central node_modules policies; comments requested dmosedale 30/11/2018 05:07 AM 4KB
   Re: Straw man mozilla-central node_modules policies; comments requested dmosedale 30/11/2018 05:25 AM 1KB
Which host/target combinations work(ish) for cross-compiling? Jonathan Watt 29/11/2018 10:01 AM 1KB
Re: Which host/target combinations work(ish) for cross-compiling? Kim Moir 29/11/2018 10:24 PM 6KB
   Re: Which host/target combinations work(ish) for cross-compiling? tritter 30/11/2018 12:54 AM 1KB
Avoiding the hard build dependency on NodeJS Martin Husemann 07/11/2018 09:32 PM 1KB
   Re: Avoiding the hard build dependency on NodeJS Boris Zbarsky 07/11/2018 10:22 PM 1KB
     Re: Avoiding the hard build dependency on NodeJS Martin Husemann 07/11/2018 10:30 PM 1KB
       Re: Avoiding the hard build dependency on NodeJS Boris Zbarsky 07/11/2018 10:42 PM 1KB
Re: Avoiding the hard build dependency on NodeJS Gregory Szorc 08/11/2018 03:27 AM 13KB
Re: Avoiding the hard build dependency on NodeJS Ehsan Akhgari 08/11/2018 10:55 PM 8KB
Re: Avoiding the hard build dependency on NodeJS Mike Hommey 09/11/2018 05:55 AM 3KB
Re: Avoiding the hard build dependency on NodeJS Dan Mosedale 09/11/2018 06:08 AM 5KB
Printing Malaysia | online printing services | 50 Percent adammiles695 29/10/2018 05:52 PM 1KB
strawman NodeJS / node_module mozilla-central proposals dmosedale 18/10/2018 12:58 AM 1KB
Subject: NodeJS 8.11.0 or newer is now a hard requirement for building Firefox dmose2 04/10/2018 05:51 AM 2KB
Converstion of makefile to moz.build Pavan D 06/09/2018 07:40 PM 1KB
Re: Converstion of makefile to moz.build Andrew Halberstadt 06/09/2018 09:00 PM 7KB
Make file errors on mozilla 2.0 build Pavan D 06/09/2018 07:03 PM 2KB
Re: Make file errors on mozilla 2.0 build Sylvestre Ledru 06/09/2018 07:39 PM 8KB
Enabling ECMAScript experimental features juan.hoyosr 26/08/2018 08:19 AM 1KB
landing --enable-nodejs by default shortly: today, Thursday, Aug _16th_ dmosedale 17/08/2018 12:52 AM 1KB
devs: please install NodeJS; it will be required by default on Thurs, Aug 17th dmosedale 14/08/2018 11:15 AM 3KB
rust compilation under local linux PC: Compilation error caused by: error reading compile response from server ISHIKAWA,chiaki 04/08/2018 12:51 PM 8KB
Better incremental builds - Tup backend ready for early adopters on Linux Michael Shal 02/08/2018 11:34 PM 12KB
   Re: Better incremental builds - Tup backend ready for early adopters on Linux Jonathan Watt 07/08/2018 09:18 PM 5KB
     Re: Better incremental builds - Tup backend ready for early adopters on Linux Boris Zbarsky 07/08/2018 10:06 PM 1KB
       Re: Better incremental builds - Tup backend ready for early adopters on Linux Jonathan Watt 07/08/2018 11:27 PM 2KB
         Re: Better incremental builds - Tup backend ready for early adopters on Linux Boris Zbarsky 07/08/2018 11:32 PM 2KB
Re: Better incremental builds - Tup backend ready for early adopters on Linux Tom Prince 07/08/2018 11:49 PM 6KB
   Re: Better incremental builds - Tup backend ready for early adopters on Linux Boris Zbarsky 08/08/2018 12:54 AM 2KB
Re: Better incremental builds - Tup backend ready for early adopters on Linux Nicholas Nethercote 08/08/2018 03:03 PM 15KB
Re: Better incremental builds - Tup backend ready for early adopters on Linux Michael Shal 08/08/2018 10:29 PM 11KB
   Re: Better incremental builds - Tup backend ready for early adopters on Linux Boris Zbarsky 09/08/2018 12:59 AM 2KB
Re: Better incremental builds - Tup backend ready for early adopters on Linux Michael Shal 08/08/2018 10:37 PM 6KB
Re: Better incremental builds - Tup backend ready for early adopters on Linux Michael Shal 09/08/2018 03:48 AM 8KB
   Re: Better incremental builds - Tup backend ready for early adopters on Linux Boris Zbarsky 09/08/2018 04:41 AM 2KB
PSA: |mach python-test| can now run with python 3 Andrew Halberstadt 03/07/2018 11:48 PM 11KB
   Re: PSA: |mach python-test| can now run with python 3 Axel Hecht 06/07/2018 06:12 PM 4KB
     Re: PSA: |mach python-test| can now run with python 3 Andrew Halberstadt 06/07/2018 09:55 PM 15KB
     Re: PSA: |mach python-test| can now run with python 3 Gregory Szorc 14/07/2018 08:07 AM 16KB
Re: PSA: |mach python-test| can now run with python 3 Dustin Mitchell 06/07/2018 10:04 PM 4KB
   Re: PSA: |mach python-test| can now run with python 3 Axel Hecht 06/07/2018 10:46 PM 2KB
     Re: PSA: |mach python-test| can now run with python 3 Andrew Halberstadt 06/07/2018 11:20 PM 9KB
Intent to uplift to 60: Taskgraph and Release automation changes Tom Prince 30/06/2018 04:31 AM 24KB
Tom Prince is now a Build Config - Taskgraph peer Dustin Mitchell 27/06/2018 09:00 PM 4KB
David Major is now a build peer Gregory Szorc 22/05/2018 07:16 AM 5KB
build firefox 60.0 on device arm64 - no build libmozsandbox.so Milan Buška 14/05/2018 07:50 PM 5KB
PSA: Changes to |mach doc| generation Andrew Halberstadt 11/05/2018 10:18 PM 8KB
PSA: Avoid Visual Studio 2017 15.7.0 Ryan VanderMeulen 08/05/2018 09:40 PM 5KB
Announcing MozillaBuild 3.2 Release Ryan VanderMeulen 04/05/2018 03:05 AM 6KB
[rfc] Trying to make sense of opt-in Node integration in mozilla-central Nicholas Alexander 21/04/2018 01:24 AM 17KB
PSA: Building Firefox 61+ with GCC will soon require version GCC 6.1+ Jeff Gilbert 03/04/2018 08:30 AM 4KB
Error while building firefox on linux : .o doesn't exist victor.fontaine95 22/03/2018 11:26 PM 3KB
   Re: Error while building firefox on linux : .o doesn't exist Sylvestre Ledru 23/03/2018 02:05 AM 5KB
The future of files-based metadata in moz.build files Gregory Szorc 21/03/2018 01:44 AM 13KB
Experimental build system group review in Phabricator Gregory Szorc 15/03/2018 01:16 AM 8KB
PSA: Visual Studio 2017 15.6 now required to build 61+ Ryan VanderMeulen 13/03/2018 08:29 AM 7KB
PSA: Build bustage with Visual Studio 2017 15.6 Ryan VanderMeulen 06/03/2018 08:41 AM 5KB
Intent to require Node to build Firefox 61 and later Nicholas Alexander 01/03/2018 08:23 AM 6KB
Compiling coco on Fedora-27 always fails with "gtk/gtk.h: No such file or directory" Clemens Eisserer 07/02/2018 01:55 AM 4KB
Compiling coco on Fedora-27 always fails with "gtk/gtk.h: No such file or directory" Clemens Eisserer 06/02/2018 12:25 AM 4KB
Exploring requiring Node.js to build Firefox Gregory Szorc 24/01/2018 08:34 AM 15KB
thunderbird building error shakedgreenfeld 04/01/2018 05:43 PM 5KB
   Re: thunderbird building error Tom Prince 05/01/2018 03:05 AM 5KB
Firefox build issues with Rust and the new VS2017 15.5 update Ryan VanderMeulen 06/12/2017 12:16 AM 5KB
Announcing MozillaBuild 3.1.1 Release Ryan VanderMeulen 29/11/2017 07:55 AM 8KB
Re: Resolving which build system entry points need to exist Tom Prince 18/11/2017 05:29 AM 9KB
   Re: Resolving which build system entry points need to exist Mike Hommey 18/11/2017 06:08 AM 4KB
Re: Resolving which build system entry points need to exist Gregory Szorc 18/11/2017 06:13 AM 11KB
Re: Resolving which build system entry points need to exist Mike Hommey 18/11/2017 06:19 AM 5KB
Re: Resolving which build system entry points need to exist Nicholas Alexander 18/11/2017 06:32 AM 14KB
   Re: Resolving which build system entry points need to exist ISHIKAWA, Chiaki 01/02/2018 07:02 AM 4KB
Re: Firefox build issues with Rust and the new VS2017 15.5 update Ryan VanderMeulen 06/12/2017 03:14 AM 7KB
Re: Firefox build issues with Rust and the new VS2017 15.5 update Ryan VanderMeulen 07/12/2017 11:00 PM 8KB
Re: Firefox build issues with Rust and the new VS2017 15.5 update James Cheng 08/12/2017 12:13 PM 14KB
Re: Firefox build issues with Rust and the new VS2017 15.5 update Ryan VanderMeulen 08/12/2017 12:46 PM 15KB
Re: Firefox build issues with Rust and the new VS2017 15.5 update Adam Gashlin 07/12/2017 03:39 AM 9KB
Re: Firefox build issues with Rust and the new VS2017 15.5 update Ryan VanderMeulen 09/12/2017 07:10 AM 16KB
Re: Exploring requiring Node.js to build Firefox Gregory Szorc 24/01/2018 08:50 AM 16KB
Re: Exploring requiring Node.js to build Firefox ISHIKAWA,chiaki 24/01/2018 03:08 PM 11KB
Re: Exploring requiring Node.js to build Firefox Dustin Mitchell 24/01/2018 09:30 PM 13KB
Re: Exploring requiring Node.js to build Firefox Sylvestre Ledru 24/01/2018 09:42 PM 7KB
Re: Exploring requiring Node.js to build Firefox ISHIKAWA,chiaki 25/01/2018 02:59 AM 5KB
   Re: Exploring requiring Node.js to build Firefox Nicholas Alexander 25/01/2018 03:09 AM 25KB
     Re: Exploring requiring Node.js to build Firefox myk 27/01/2018 03:40 AM 3KB
Re: Exploring requiring Node.js to build Firefox ISHIKAWA,chiaki 25/01/2018 04:32 AM 3KB
Re: [mozlintf] Exploring requiring Node.js to build Firefox Gregory Szorc 21/04/2018 02:33 AM 14KB
Re: PSA: Build bustage with Visual Studio 2017 15.6 Ryan VanderMeulen 07/03/2018 02:40 AM 6KB
Re: Intent to require Node to build Firefox 61 and later Peter Saint-Andre 07/03/2018 05:13 AM 6KB
Re: Intent to require Node to build Firefox 61 and later Nicholas Alexander 07/03/2018 06:36 AM 8KB
   Re: Intent to require Node to build Firefox 61 and later Boris Zbarsky 07/03/2018 06:41 AM 1KB
Re: Intent to require Node to build Firefox 61 and later Peter Saint-Andre 07/03/2018 07:34 AM 8KB
Re: PSA: Visual Studio 2017 15.6 now required to build 61+ Jeff Gilbert 14/03/2018 04:34 AM 5KB
Re: PSA: Visual Studio 2017 15.6 now required to build 61+ Jeff Gilbert 14/03/2018 04:41 AM 6KB
Re: The future of files-based metadata in moz.build files Joel Maher 21/03/2018 02:34 AM 16KB
   Re: The future of files-based metadata in moz.build files Tom Prince 21/03/2018 03:42 AM 6KB
   Re: The future of files-based metadata in moz.build files Dustin Mitchell 21/03/2018 03:33 PM 9KB
Re: The future of files-based metadata in moz.build files Christopher Manchester 27/03/2018 05:32 AM 18KB
   Re: The future of files-based metadata in moz.build files Gregory Szorc 28/03/2018 11:27 PM 16KB
Re: Intent to require Python 3 to build Firefox 59 and later Gregory Szorc 04/04/2018 02:13 AM 7KB
Re: PSA: Building Firefox 61+ with GCC will soon require version GCC 6.1+ Jeff Gilbert 05/04/2018 04:40 AM 4KB
   Re: PSA: Building Firefox 61+ with GCC will soon require version GCC 6.1+ Nicholas Nethercote 05/04/2018 04:53 PM 8KB
Re: PSA: Building Firefox 61+ with GCC will soon require version GCC 6.1+ Mike Hommey 05/04/2018 05:22 PM 3KB
Re: [rfc] Trying to make sense of opt-in Node integration in mozilla-central Gregory Szorc 21/04/2018 02:48 AM 22KB
Re: PSA: Changes to |mach doc| generation Andreas Tolfsen 16/05/2018 09:38 PM 5KB
Re: David Major is now a build peer Gabriela Montagu 22/05/2018 07:41 AM 9KB
   Re: David Major is now a build peer Kim Moir 23/05/2018 01:07 AM 6KB
Re: FYI: firefox native build experience on ARM64 Linux Nicholas Alexander 19/06/2018 01:06 AM 12KB
Re: Tom Prince is now a Build Config - Taskgraph peer Gabriela Montagu 27/06/2018 10:07 PM 6KB
   Re: Tom Prince is now a Build Config - Taskgraph peer Kim Moir 27/06/2018 10:54 PM 6KB
   Re: Tom Prince is now a Build Config - Taskgraph peer Nicholas Alexander 27/06/2018 11:57 PM 5KB
Re: PSA: |mach python-test| can now run with python 3 David Burns 03/07/2018 11:56 PM 12KB
Re: Intent to uplift to 60: Taskgraph and Release automation changes Tom Prince 10/07/2018 06:19 AM 26KB
Re: Intent to uplift to 60: Taskgraph and Release automation changes Tom Prince 09/11/2018 12:39 AM 28KB
Re: Intent to uplift to 60: Taskgraph and Release automation changes Ryan VanderMeulen 09/11/2018 12:41 AM 29KB
Re: Intent to uplift to 60: Taskgraph and Release automation changes Jordan Lund 09/11/2018 04:48 AM 31KB
Re: Using clang-cl to ship Windows builds Chris Peterson 11/07/2018 04:31 AM 5KB
   Re: Using clang-cl to ship Windows builds Gregory Szorc 11/07/2018 04:50 AM 8KB
Re: Using clang-cl to ship Windows builds Bobby Holley 11/07/2018 05:36 AM 10KB
Re: Using clang-cl to ship Windows builds Stuart Philp 22/08/2018 06:15 AM 10KB
Re: rust compilation under local linux PC: Compilation error caused by: error reading compile response from server ISHIKAWA,chiaki 04/08/2018 10:11 PM 11KB
Re: rust compilation under local linux PC: Compilation error caused by: error reading compile response from server ISHIKAWA,chiaki 05/08/2018 05:32 AM 24KB
Upcoming Firefox NodeJS 8 build requirement (soft for Fx 63, hard for Fx 64) Dan Mosedale 09/08/2018 02:58 AM 47KB
   Re: Upcoming Firefox NodeJS 8 build requirement (soft for Fx 63, hard for Fx 64) dmosedale 09/08/2018 04:12 AM 1KB
Re: Better incremental builds - Tup backend ready for early adopters on Linux Myk Melez 09/08/2018 08:24 AM 5KB
Re: Better incremental builds - Tup backend ready for early adopters on Linux Mike Hommey 09/08/2018 04:18 PM 3KB
Re: Better incremental builds - Tup backend ready for early adopters on Linux Michael Shal 11/08/2018 04:32 AM 8KB
devs: please install NodeJS; it will be required by default on Thurs, Aug 17th Dan Mosedale 14/08/2018 09:12 AM 18KB
devs: please install NodeJS; it will be required by default on Thurs, Aug 17th Dan Mosedale 14/08/2018 11:07 AM 6KB
New Tool Available To Analyze Build Dependencies Sofia Carrillo 18/08/2018 07:51 AM 7KB
Re: New Tool Available To Analyze Build Dependencies Nicholas Alexander 31/08/2018 04:46 AM 8KB
Re: New Tool Available To Analyze Build Dependencies Michael Shal 31/08/2018 06:38 AM 12KB
Re: plan to make Node.js mandatory might be problematic for sparc/Solaris Gregory Szorc 21/08/2018 12:43 AM 8KB
Introducing CI-Admin Dustin Mitchell 23/08/2018 03:24 AM 6KB
Re: Introducing CI-Admin Dustin Mitchell 07/09/2018 03:09 AM 5KB
Re: Feature flags used in Firefox Source Code juan.hoyosr 26/08/2018 01:11 PM 2KB
Evolve extension gets in the way: don't offer to add evolve to one's hgrc when |mach bootstrap| is executed. ISHIKAWA,chiaki 10/10/2018 09:51 PM 7KB
   Re: Evolve extension gets in the way: don't offer to add evolve to one's hgrc when |mach bootstrap| is executed. gsquelart 11/10/2018 07:49 AM 4KB
Re: Evolve extension gets in the way: don't offer to add evolve to one's hgrc when |mach bootstrap| is executed. ISHIKAWA,chiaki 11/10/2018 11:14 AM 10KB
Help needed: building with -finstrument-functions Victor Porof 10/11/2018 09:57 PM 4KB
Re: Help needed: building with -finstrument-functions Nathan Froyd 12/11/2018 03:19 AM 6KB
Re: Help needed: building with -finstrument-functions Victor Porof 12/11/2018 11:38 PM 7KB
mtime comparison considered harmful Gregory Szorc 15/11/2018 05:55 AM 5KB
Building NSS with MozillaBuild 3.2 and VS 2017 John Jiang 20/11/2018 08:28 PM 5KB
Re: Building NSS with MozillaBuild 3.2 and VS 2017 Gregory Szorc 27/11/2018 12:18 AM 8KB
HG problem: abort: decoding near '9: error: ‘sse2::l': 'ascii' codec can't decode byte 0xe2 in position 213: ordinal not... ISHIKAWA,chiaki 02/12/2018 03:53 PM 10KB
Build fails when filename starts with uppercase pubkeypin 30/12/2018 01:58 AM 5KB
   Re: Build fails when filename starts with uppercase tcampbell 12/01/2019 02:26 AM 3KB
Re: Build fails when filename starts with uppercase pubkeypin 20/01/2019 11:31 PM 5KB
[PSA] Upcoming changes to flake8 linter Andrew Halberstadt 02/02/2019 12:08 AM 13KB
Re: [PSA] Upcoming changes to flake8 linter Mike Hommey 02/02/2019 05:39 AM 4KB
Re: [PSA] Upcoming changes to flake8 linter Andrew Halberstadt 02/02/2019 05:54 AM 7KB
Re: [PSA] Upcoming changes to flake8 linter Andrew Halberstadt 08/02/2019 10:50 PM 15KB
Re: [PSA] Upcoming changes to flake8 linter Andrew Halberstadt 26/02/2019 10:32 PM 17KB
New build system module owner Gregory Szorc 16/03/2019 02:51 AM 6KB
Re: New build system module owner ISHIKAWA,chiaki 16/03/2019 07:15 PM 4KB
Tom Prince promoted to owner of the Build Config :: Taskgraph submodule Dustin Mitchell 20/03/2019 12:31 AM 6KB
Re: Tom Prince promoted to owner of the Build Config :: Taskgraph submodule Nicholas Alexander 20/03/2019 12:40 AM 7KB
Re: Tom Prince promoted to owner of the Build Config :: Taskgraph submodule Andrew Halberstadt 20/03/2019 01:10 AM 8KB
Proposal: Bump the minimum version of node to 8.12.0 and npm to 6.4.1 Mark Banner 17/04/2019 09:54 PM 5KB
Re: Proposal: Bump the minimum version of node to 8.12.0 and npm to 6.4.1 Nicholas Alexander 18/04/2019 12:29 AM 7KB
   Re: Proposal: Bump the minimum version of node to 8.12.0 and npm to 6.4.1 dmosedale 30/04/2019 11:28 PM 2KB
Re: Proposal: Bump the minimum version of node to 8.12.0 and npm to 6.4.1 Mike Hommey 18/04/2019 10:13 AM 3KB
Re: Proposal: Bump the minimum version of node to 8.12.0 and npm to 6.4.1 Nicholas Alexander 01/05/2019 12:19 AM 8KB
Re: First Time Build Error: Cannot find the target C compiler Barret Rennie 10/06/2019 10:17 PM 11KB
PSA: Certain mach commands (including new ones) starting to run with Python 3 Andrew Halberstadt 28/08/2019 09:46 PM 8KB
Where did all the TryChooser pages go? ISHIKAWA,chiaki 30/08/2019 01:07 AM 3KB
Re: Where did all the TryChooser pages go? Andrew Halberstadt 30/08/2019 02:31 AM 8KB
Re: Where did all the TryChooser pages go? ISHIKAWA,chiaki 30/08/2019 02:56 AM 5KB
Re: Where did all the TryChooser pages go? ISHIKAWA,chiaki 30/08/2019 03:19 AM 6KB
Re: Where did all the TryChooser pages go? ishikawa 30/08/2019 06:37 PM 9KB
Re: Where did all the TryChooser pages go? Botond Ballo 30/08/2019 10:21 PM 5KB
   Re: Where did all the TryChooser pages go? ISHIKAWA, Chiaki 02/09/2019 04:05 AM 2KB
     Re: Where did all the TryChooser pages go? ISHIKAWA, Chiaki 02/09/2019 04:05 AM 4KB
Fwd: Reminder: Planned Taskcluster migration this weekend (Nov 9) Chris Cooper 05/11/2019 06:08 AM 19KB
Announcing MozillaBuild 3.3 Release glob 13/11/2019 01:41 PM 6KB
Shutting down legacy Taskcluster deployment Chris Cooper 26/06/2020 05:13 AM 5KB
Re: Shutting down legacy Taskcluster deployment Kartikaya Gupta 26/06/2020 06:41 PM 6KB
Re: Shutting down legacy Taskcluster deployment Chris Cooper 26/06/2020 09:53 PM 7KB
Re: Shutting down legacy Taskcluster deployment Kartikaya Gupta 27/06/2020 03:01 AM 8KB
Re: Shutting down legacy Taskcluster deployment Jeff Muizelaar 27/06/2020 03:13 AM 9KB
Re: Shutting down legacy Taskcluster deployment Andrew Halberstadt 27/06/2020 03:34 AM 18KB
Re: Shutting down legacy Taskcluster deployment Mike Hommey 27/06/2020 04:35 AM 5KB
How to force rust target in firefox build John Frankish 02/07/2020 01:34 AM 8KB
Re: How to force rust target in firefox build Mike Hommey 02/07/2020 05:07 AM 5KB